{"text_format":"1","workbook":"xlsx","n_sheets":9,"sheets":["Instructions","Calculator_SM","Incentives_SM","Calculator_MS","Incentives_MS","Measure Totals","Lists","Avoided Costs","Com LU Table"],"not_rendered":{"charts":0,"images":2,"macros":1,"external_links":0,"defined_names":138,"comments":0,"pivot_tables":0},"unopened":[],"bounds":{"document_bytes":16777216,"sheet_cells":100000,"rows_first":2000,"rows_last":500,"rows_between":2000,"halvings":0,"cell_chars":16384,"cell_head_chars":4096},"cells_cut":0,"cells_raw":0,"read":"whole","date_system":"1900"}

{"sheet":"Instructions","index":0,"n_rows":61,"n_cols":10,"rows_kept":61,"cut":false,"hidden":false,"merged":[[3,3,3,12],[5,3,5,12],[60,4,60,8],[35,4,35,8],[36,4,36,8],[37,4,37,8],[38,4,38,8],[39,4,39,8],[40,4,40,8],[41,4,41,8],[42,4,42,8],[43,4,43,8],[44,4,44,8],[45,4,45,8],[47,4,47,8],[48,4,48,8],[49,4,49,8],[57,4,57,8],[1,3,1,12],[2,3,2,12],[4,3,4,12],[22,4,22,8],[33,4,33,8],[34,4,34,8],[23,4,23,8],[24,4,24,8],[25,4,25,8],[26,4,26,8],[27,4,27,8],[28,4,28,8],[29,4,29,8],[30,4,30,8],[58,4,58,8],[59,4,59,8],[50,4,50,8],[51,4,51,8],[52,4,52,8],[53,4,53,8],[54,4,54,8],[55,4,55,8],[56,4,56,8],[31,4,31,8],[32,4,32,8],[46,4,46,8],[16,1,19,1],[11,3,14,12],[21,4,21,8],[4,1,7,1],[6,3,10,12],[18,4,18,8],[19,4,19,8],[20,4,20,8],[17,4,17,8],[16,4,16,9],[9,1,14,1]]}
[]
[null,null,null,"Instructions for use of Energy Trust Cost Effectiveness Calculator"]
[null,null,null,"1. Enter all relevant project information in the boxes at the top left."]
[null,null,null,"2. Enter the project's electric and gas utilities and utility rates in the boxes at the top center."]
[null,"Purpose: The Savings Summary Worksheet tool, containing the Cost Effectiveness Calculator, and its information was developed and is made available by Energy Trust of Oregon, Inc. (Energy Trust) to New Buildings Program participants for the sole purpose of assisting projects with estimating whether incentives may be available in support of a customer's potential commercial new construction or major renovation project enrolling in the Modeled Savings, Path to Net Zero, Data Center and/or Special Measure offerings.",null,"3. Enter the measure name or description in the first column."]
[null,null,null,"4. Select the most applicable sub-sector for the project building type."]
[null,null,null,"5. Choose the best appropriate load profile descriptors for when the savings happen.\n\n  For example, choose the \"Cooling\" electric load profile and the \"Com Heating\" natural gas load profile for HVAC improvement measures which involve natural gas heating.\n\nIf there are no savings for a particular fuel, choose \"None\" for the load profile for that fuel."]
[]
[]
[null,"Program Information:  User should always verify with Energy Trust that it is using the version of the Savings Summary Worksheet currently in effect. The project analyst should input the project's energy efficiency measures (EEMs), estimated kWh and therm savings, and the estimated incremental cost, and the embedded Cost Effectiveness Calculator will return an estimated potential installation incentive for measures that are cost effective, according to the Energy Trust of Oregon cost effectivness criteria. For more information on the Savings Summary Worksheet and participation in the above listed offerings, please see the Program's Technical Guidelines."]
{"$rows_left_out":52}
{"sheet":"Calculator_SM","index":1,"n_rows":40,"n_cols":25,"rows_kept":40,"cut":false,"hidden":false,"merged":[[13,23,13,24],[3,10,9,18],[13,5,14,5],[13,8,13,9],[13,20,13,21],[13,16,14,16],[13,17,14,17],[13,10,14,10],[13,12,14,12],[13,13,14,13],[13,14,14,14],[13,15,14,15],[13,6,13,7],[13,11,14,11],[0,0,0,5],[1,0,1,2],[10,1,10,4],[13,0,14,0],[13,1,14,1],[13,2,14,2],[13,3,13,4],[3,1,3,2],[4,1,4,2],[5,1,5,2],[6,1,6,2],[7,1,7,2],[8,1,8,2]]}
["Savings Summary Worksheet - Energy Trust of Oregon New Buildings Program"]
["Based on:  Energy Trust of Oregon Cost Effectiveness Calculator v1.0\nVersion:  1/1/2016"]
[]
["Project Name:",null,null,null,"Electric Utility","PAC","Gas Utility","CNG",null,null,"NOTE TO USERS:  All Special Measures must be tested for cost effectiveness using the Energy Trust Cost Effectiveness Calculator embedded in this worksheet and submitted for review and approval by Energy Trust.\n\nThis worksheet provides estimates of cost effectiveness and program incentives based on information submitted by the project analyst, including savings calculations, supporting documentation, incremental cost estimates, and other information as requested by Energy Trust. \n\nThis spreadsheet will be updated to address changes to savings estimates and incremental costs addressed during the review process and final site verification of installed measures."]
["Project Description:",null,null,null,"Electric Rate",7.6200000000000004E-2,"Gas Rate",0.86650000000000005]
["Organization Name:"]
["Date:"]
["Oregon Energy Code:"]
["Project Type:"]
[]
{"$rows_left_out":31}
{"sheet":"Incentives_SM","index":2,"n_rows":39,"n_cols":12,"rows_kept":39,"cut":false,"hidden":true,"merged":[]}
[]
[null,"New Building Special Measure Incentive Rules",null,null,null,null,null,null,"Utility Eligibility"]
[null,"Measure Type","$/kWh","$/therm",null,"Incremental Cost Cap %","Minimum Payback (yrs)",null,"Electric","Gas"]
[null,"New Construction - Lighting",0.2,0.8,null,1,{"$f":"ROUND(0.95,1)","v":1},null,{"$f":"IF(Calculator_SM!F4<>\"Other\",TRUE,FALSE)","v":true},{"$f":"IF(Calculator_SM!H4<>\"Other\",TRUE,FALSE)","v":true}]
[null,"New Construction - Non-Lighting",0.15,0.8]
[null,"Major Renovation - Lighting",0.2,1]
[null,"Major Renovation - Non-Lighting",0.25,1]
[null,"as of 1/1/2016"]
[]
[]
{"$rows_left_out":30}
{"sheet":"Calculator_MS","index":3,"n_rows":38,"n_cols":27,"rows_kept":38,"cut":false,"hidden":false,"merged":[[13,25,13,26],[33,8,34,8],[30,2,30,5],[31,2,31,5],[32,2,32,5],[13,17,14,17],[13,18,14,18],[13,19,14,19],[13,13,14,13],[13,8,13,9],[13,10,13,11],[13,14,14,14],[13,5,14,5],[13,6,13,7],[13,12,14,12],[13,15,14,15],[10,1,10,4],[37,2,37,5],[37,6,37,7],[32,6,32,7],[36,2,36,5],[36,6,36,7],[35,2,35,5],[33,2,33,5],[34,2,34,5],[13,22,13,23],[13,16,14,16],[12,21,12,23],[2,9,8,17],[0,0,0,5],[1,0,1,5],[13,0,14,0],[13,1,14,1],[13,2,14,2],[13,3,13,4],[3,1,3,2],[4,1,4,2],[6,1,6,2],[7,1,7,2],[5,1,5,2],[8,1,8,2]]}
["Savings Summary Worksheet - Energy Trust of Oregon New Buildings Program"]
["Based on:  Energy Trust of Oregon Cost Effectiveness Calculator v1.0\nVersion:  1/1/2016"]
[null,null,null,null,null,null,null,null,null,"NOTE TO USERS:  All Modeled Savings, Path to Net Zero and Data Center projects requiring cost effectiveness testing must be submitted for review and approval by Energy Trust.\n\nThis worksheet provides estimates of cost effectiveness and program incentives based on information submitted by the project analyst, including savings calculations, supporting documentation, incremental cost estimates, and other information as requested by Energy Trust. \n\nThis spreadsheet will be updated to address changes to savings estimates and incremental costs addressed during the review process and final site verification of installed measures."]
["Project Name:",null,null,null,"Electric Utility","PGE","Gas Utility","NWN"]
["Project Description:",null,null,null,"Electric Rate",7.6200000000000004E-2,"Gas Rate",0.86650000000000005]
["Organization Name:"]
["Date:"]
["Oregon Energy Code:"]
["Program Offering:"]
[]
{"$rows_left_out":29}
{"sheet":"Incentives_MS","index":4,"n_rows":69,"n_cols":12,"rows_kept":69,"cut":false,"hidden":true,"merged":[[33,3,33,4],[32,3,32,6],[33,5,33,6]]}
[]
[null,"New Building Modeled Savings Incentive Rules",null,null,null,null,null,null,"Utility Eligibility"]
[null,"Project Type","$/kWh","$/therm",null,"Incremental Cost Cap %","Minimum Payback (yrs)",null,"Electric","Gas"]
[null,"Modeled Savings - Major Renovation - Lighting",{"$f":"VLOOKUP(Calculator_MS!$G$38,$C$36:$G$65,4)","v":{"$error":"#N/A"}},1,null,1,{"$f":"ROUND(0.95,0)","v":1},null,{"$f":"IF(Calculator_MS!F4<>\"Other\",TRUE,FALSE)","v":true},{"$f":"IF(Calculator_MS!H4<>\"Other\",TRUE,FALSE)","v":true}]
[null,"Modeled Savings - Major Renovation - Non-Lighting",{"$f":"VLOOKUP(Calculator_MS!$G$38,$C$36:$G$65,5)","v":{"$error":"#N/A"}},1]
[null,"Modeled Savings - New Construction - Lighting",{"$f":"VLOOKUP(Calculator_MS!$G$38,$C$36:$G$65,2)","v":{"$error":"#N/A"}},0.8]
[null,"Modeled Savings - New Construction - Non-Lighting",{"$f":"VLOOKUP(Calculator_MS!$G$38,$C$36:$G$65,3)","v":{"$error":"#N/A"}},0.8]
[null,"Data Center - Lighting",0.2,0.8]
[null,"Data Center - Non-Lighting",0.2,0.8]
[null,"Path to Net Zero - Lighting",0.4,1.2]
{"$rows_left_out":60}
{"sheet":"Measure Totals","index":5,"n_rows":52,"n_cols":16,"rows_kept":52,"cut":false,"hidden":true,"merged":[[47,1,47,2],[48,1,48,2],[49,1,49,2],[50,1,50,2],[41,1,41,2],[42,1,42,2],[43,1,43,2],[44,1,44,2],[45,1,45,2],[46,1,46,2],[40,1,40,2],[25,1,25,2],[26,1,26,2],[27,1,27,2],[28,1,28,2],[29,1,29,2],[30,1,30,2],[35,1,35,2],[36,1,36,2],[37,1,37,2],[38,1,38,2],[39,1,39,2],[24,1,24,2],[13,1,13,2],[14,1,14,2],[15,1,15,2],[16,1,16,2],[17,1,17,2],[18,1,18,2],[19,1,19,2],[20,1,20,2],[21,1,21,2],[22,1,22,2],[23,1,23,2],[12,1,12,2],[0,0,0,1],[0,2,0,4],[1,0,1,1],[2,0,2,1],[5,1,5,2],[6,1,6,2],[7,1,7,2],[8,1,8,2],[9,1,9,2],[10,1,10,2],[11,1,11,2]]}
["Project Name"]
["Project #"]
["PT ID"]
[]
["Special Measures"]
["#","Measure Name",null,"Project Track Name","Incremental Cost","Measure Life","kWh savings","therm savings","kWh incentive","therm incentive","total incentive","Payback before incentive","negative kWh","negative therms","Elec Allocation of Utility Benefits","Gas Allocation of Utility Benefits"]
[1,{"$f":"Calculator_SM!B16","v":0},null,null,{"$f":"IF(K7=\"\", \"\",Calculator_SM!K16)","v":""},{"$f":"IF(K7=\"\", \"\", Calculator_SM!F16)","v":""},{"$f":"IF(OR(K7=\"\",Calculator_SM!I16<0),0,Calculator_SM!I16)","v":0},{"$f":"IF(OR(K7=\"\",Calculator_SM!J16<0),0,Calculator_SM!J16)","v":0},{"$f":"IF(K7=\"\",\"\",Calculator_SM!U16)","v":""},{"$f":"IF(K7=\"\",\"\",Calculator_SM!V16)","v":""},{"$f":"IF(OR(Incentives_SM!G15=\"No\",Incentives_SM!H15=\"No\"),\"\",Incentives_SM!I15)","v":""},{"$f":"Calculator_SM!R16","v":""},{"$f":"IF(OR(K7=\"\",Calculator_SM!I16>=0),\"\",Calculator_SM!I16)","v":""},{"$f":"IF(OR(K7=\"\",Calculator_SM!J16>=0),\"\",Calculator_SM!J16)","v":""},{"$f":"Incentives_SM!K15","v":0},{"$f":"Incentives_SM!L15","v":0}]
[2,{"$f":"Calculator_SM!B17","v":0},null,null,{"$f":"IF(K8=\"\", \"\",Calculator_SM!K17)","v":""},{"$f":"IF(K8=\"\", \"\", Calculator_SM!F17)","v":""},{"$f":"IF(OR(K8=\"\",Calculator_SM!I17<0),0,Calculator_SM!I17)","v":0},{"$f":"IF(OR(K8=\"\",Calculator_SM!J17<0),0,Calculator_SM!J17)","v":0},{"$f":"IF(K8=\"\",\"\",Calculator_SM!U17)","v":""},{"$f":"IF(K8=\"\",\"\",Calculator_SM!V17)","v":""},{"$f":"IF(OR(Incentives_SM!G16=\"No\",Incentives_SM!H16=\"No\"),\"\",Incentives_SM!I16)","v":""},{"$f":"Calculator_SM!R17","v":""},{"$f":"IF(OR(K8=\"\",Calculator_SM!I17>=0),\"\",Calculator_SM!I17)","v":""},{"$f":"IF(OR(K8=\"\",Calculator_SM!J17>=0),\"\",Calculator_SM!J17)","v":""},{"$f":"Incentives_SM!K16","v":0},{"$f":"Incentives_SM!L16","v":0}]
[3,{"$f":"Calculator_SM!B18","v":0},null,null,{"$f":"IF(K9=\"\", \"\",Calculator_SM!K18)","v":""},{"$f":"IF(K9=\"\", \"\", Calculator_SM!F18)","v":""},{"$f":"IF(OR(K9=\"\",Calculator_SM!I18<0),0,Calculator_SM!I18)","v":0},{"$f":"IF(OR(K9=\"\",Calculator_SM!J18<0),0,Calculator_SM!J18)","v":0},{"$f":"IF(K9=\"\",\"\",Calculator_SM!U18)","v":""},{"$f":"IF(K9=\"\",\"\",Calculator_SM!V18)","v":""},{"$f":"IF(OR(Incentives_SM!G17=\"No\",Incentives_SM!H17=\"No\"),\"\",Incentives_SM!I17)","v":""},{"$f":"Calculator_SM!R18","v":""},{"$f":"IF(OR(K9=\"\",Calculator_SM!I18>=0),\"\",Calculator_SM!I18)","v":""},{"$f":"IF(OR(K9=\"\",Calculator_SM!J18>=0),\"\",Calculator_SM!J18)","v":""},{"$f":"Incentives_SM!K17","v":0},{"$f":"Incentives_SM!L17","v":0}]
[4,{"$f":"Calculator_SM!B19","v":0},null,null,{"$f":"IF(K10=\"\", \"\",Calculator_SM!K19)","v":""},{"$f":"IF(K10=\"\", \"\", Calculator_SM!F19)","v":""},{"$f":"IF(OR(K10=\"\",Calculator_SM!I19<0),0,Calculator_SM!I19)","v":0},{"$f":"IF(OR(K10=\"\",Calculator_SM!J19<0),0,Calculator_SM!J19)","v":0},{"$f":"IF(K10=\"\",\"\",Calculator_SM!U19)","v":""},{"$f":"IF(K10=\"\",\"\",Calculator_SM!V19)","v":""},{"$f":"IF(OR(Incentives_SM!G18=\"No\",Incentives_SM!H18=\"No\"),\"\",Incentives_SM!I18)","v":""},{"$f":"Calculator_SM!R19","v":""},{"$f":"IF(OR(K10=\"\",Calculator_SM!I19>=0),\"\",Calculator_SM!I19)","v":""},{"$f":"IF(OR(K10=\"\",Calculator_SM!J19>=0),\"\",Calculator_SM!J19)","v":""},{"$f":"Incentives_SM!K18","v":0},{"$f":"Incentives_SM!L18","v":0}]
{"$rows_left_out":43}
{"sheet":"Lists","index":6,"n_rows":21,"n_cols":21,"rows_kept":21,"cut":false,"hidden":true,"merged":[]}
["LOOKUPS"]
["Sector","Commercial","Industrial","Residential","Com End Use","Ind End Use","Res End Use","Gas Load Profiles",null,"Electric Utility","Gas Utility",null,"Code Year",null,null,"Program Offering","Project Type",null,"Y/N",null,"Fast Track Name"]
["Commercial","College","Not applicable","Not applicable","Compressed Air","Ag-Irrigation","Res Refrigerator","DHW",null,"PGE","NWN",null,2010,null,null,"Modeled Savings - Major Renovation","New Construction",null,"Yes",null,"Controls - Custom"]
["Industrial","Grocery",null,null,"Cooking","Flat","Res Freezer","Flat",null,"PAC","NWN-Firm",null,2014,null,null,"Modeled Savings - New Construction","Major Renovation",null,"No",null,"Custom"]
["Residential","Healthcare",null,null,"Cooling","1-Shift Industrial","Res Dryer","Res Heating",null,"Other","CNG",null,null,null,null,"Data Center",null,null,null,null,"Custom Gas"]
[null,"Lodging",null,null,"Exterior Lighting","2-Shift Industrial","Res Clotheswasher","Com Heating",null,null,"Other",null,null,null,null,"Path to Net Zero",null,null,null,null,"Envelope - Shell - Custom"]
[null,"Large Office",null,null,"Heating","3-Shift Industrial","Res Central AC","Solar DHW",null,null,null,null,null,null,null,null,null,null,null,null,"HVAC - Custom"]
[null,"Other",null,null,"Hot Water","None","Res Window AC","Solar Pool",null,null,null,null,null,null,null,null,null,null,null,null,"Lighting - Custom"]
[null,"Restaurant",null,null,"Indoor Lighting",null,"Res Water Heat","Clotheswasher",null,null,null,null,null,null,null,null,null,null,null,null,"Lighting Controls - Custom"]
[null,"Retail",null,null,"Misc",null,"Res HP Water Heat","None",null,null,null,null,null,null,null,null,null,null,null,null,"Motors - Custom"]
{"$rows_left_out":12}
{"sheet":"Avoided Costs","index":7,"n_rows":171,"n_cols":21,"rows_kept":171,"cut":false,"hidden":true,"merged":[[1,5,1,6],[1,10,1,17],[1,19,1,20]]}
["Gas Avoided Costs",null,null,null,null,null,null,null,"Electric Avoided Costs"]
["Load Profile Name","Lifetime","Concatenation","PV Avoided Cost",null,"Gas Avoided Cost Info",null,null,null,null,"Lifetime (yrs)",null,null,null,null,null,null,null,null,"Electric Avoided Cost Info"]
["Res Heating",0,{"$f":"A3&B3","v":"Res Heating0"},0,null,"Updated on","2015-07-13",null,"Load Profile Name","Friendly Name",0,10,20,30,40,50,60,70,null,"Updated on","2015-07-22"]
["Res Heating",10,{"$f":"A4&B4","v":"Res Heating10"},3.931562312890617,null,"Base Year","2016$",null,"R-All-Ref-Refrig-All-All-C","Res Refrigerator",0,0.55127783907000272,0.98764535510293783,1.2728336939643505,1.4563802009827103,1.5745102773145194,1.6505385012281635,1.6994700774274989,null,"Base Year","2016$"]
["Res Heating",20,"Res Heating20",6.7022996923005653,null,"Discount Rate",4.4999999999999998E-2,null,"R-All-Ref-Freezer-All-All-R","Res Freezer",0,0.55007635338632677,0.98599314877457267,1.2707944343941067,1.4540918349067069,1.572061586909723,1.6479866264833007,1.6968517934974854,null,"Discount Rate",4.4999999999999998E-2]
["Res Heating",30,"Res Heating30",8.4924997701368934,null,"Source","Link",null,"R-All-Plug-Dryer-All-All-R","Res Dryer",0,0.73628348028433765,1.2914478012327126,1.6539230546331216,1.8872112280130664,2.0373549173502039,2.1339870231323173,2.1961792065608075,null,"Source","Link"]
["Res Heating",40,"Res Heating40",9.6452591566280432,null,"Inputs","NWN 2014; CNG 2015",null,"R-All-WH-Cwash-All-All-R","Res Clotheswasher",0,0.62634981297556314,1.115978997691911,1.435444401098096,1.6410515417775426,1.7733797871763979,1.8585459174599752,1.9133586275175816,null,"Inputs","PGE 2015; PAC 2014"]
["Res Heating",50,"Res Heating50",10.387552836309663,null,null,null,null,"R-All-HVAC-CAC-All-All-E","Res Central AC",0,1.0324786485419224,1.7847150295130538,2.2733418540611168,2.5878208655078381,2.7902187766990165,2.9204815699649282,3.0043183803824522]
["Res Heating",60,"Res Heating60",10.865536284852597,null,null,null,null,"R-All-HVAC-RAC-All-All-E","Res Window AC",0,1.1188938363606715,1.9277518131654232,2.4528542844574388,2.7908089316114855,3.0083157036744592,3.1483025222953902,3.238397691295166]
["Res Heating",70,"Res Heating70",11.17332305892158,null,null,null,null,"Residential-res-Water Heating","Res Water Heat",0,0.61561482851666982,1.0980413772535176,1.4130584023027029,1.6158025777130121,1.7462882257708847,1.8302684649793615,1.8843179384845623]
{"$rows_left_out":162}
{"sheet":"Com LU Table","index":8,"n_rows":18,"n_cols":16,"rows_kept":18,"cut":false,"hidden":true,"merged":[]}
[]
[null,null,"Compressed Air","Cooking","Cooling","Exterior Lighting","Heating","Hot Water","Indoor Lighting","Misc","Motors","Office Equipment","Process","Refrigeration","Ventilation","None"]
[null,"College","Commercial-college-AirComp","Commercial-college-Cook","Commercial-college-Cool","Commercial-college-ExtLight","Commercial-college-Heat","Commercial-college-HotWater","C-Unv-Lgt-LPD Int-All-All-C","Commercial-college-Misc","Commercial-college-Motors","Commercial-college-OffEquip","Commercial-college-Process","Commercial-college-Refrig","Commercial-college-Vent","None"]
[null,"Grocery","Commercial-Grocery-AirComp","Commercial-Grocery-Cook","Commercial-Grocery-Cool","Commercial-Grocery-ExtLight","Commercial-Grocery-Heat","Commercial-Grocery-HotWater","C-Gro-Lgt-LPD Int-All-All-C","Commercial-Grocery-Misc","Commercial-Grocery-Motors","Commercial-Grocery-OffEquip","Commercial-Grocery-Process","Commercial-Grocery-Refrig","Commercial-Grocery-Vent","None"]
[null,"Healthcare","Commercial-Healthcare-AirComp","Commercial-Healthcare-Cook","Commercial-Healthcare-Cool","Commercial-Healthcare-ExtLight","Commercial-Healthcare-Heat","Commercial-Healthcare-HotWater","C-Hos-Lgt-LPD Int-All-All-C","Commercial-Healthcare-Misc","Commercial-Healthcare-Motors","Commercial-Healthcare-OffEquip","Commercial-Healthcare-Process","Commercial-Healthcare-Refrig","Commercial-Healthcare-Vent","None"]
[null,"Lodging","Commercial-Lodging-AirComp","Commercial-Lodging-Cook","Commercial-Lodging-Cool","Commercial-Lodging-ExtLight","Commercial-Lodging-Heat","Commercial-Lodging-HotWater","C-Lod-Lgt-LPD Int-All-All-C","Commercial-Lodging-Misc","Commercial-Lodging-Motors","Commercial-Lodging-OffEquip","Commercial-Lodging-Misc","Commercial-Lodging-Refrig","Commercial-Lodging-Vent","None"]
[null,"Large Office","Commercial-large Office-AirComp","Commercial-large Office-Cook","Commercial-large Office-Cool","Commercial-large Office-ExtLight","Commercial-large Office-Heat","Commercial-large Office-HotWater","C-LOff-Lgt-LPD Int-All-All-C","Commercial-large Office-Misc","Commercial-large Office-Motors","Commercial-large Office-OffEquip","Commercial-large Office-Process","Commercial-large Office-Refrig","Commercial-large Office-Vent","None"]
[null,"Other","Commercial-Misc. Com-AirComp","Commercial-Misc. Com-Cook","Commercial-Misc. Com-Cool","Commercial-Misc. Com-ExtLight","Commercial-Misc. Com-Heat","Commercial-Misc. Com-HotWater","C-Oth-Lgt-LPD Int-All-All-C","Commercial-Misc. Com-Misc","Commercial-Misc. Com-Motors","Commercial-Misc. Com-OffEquip","Commercial-Misc. Com-Process","Commercial-Misc. Com-Refrig","Commercial-Misc. Com-Vent","None"]
[null,"Restaurant","Commercial-Resturant-AirComp","Commercial-Resturant-Cook","Commercial-Resturant-Cool","Commercial-Resturant-ExtLight","Commercial-Resturant-Heat","Commercial-Resturant-HotWater","C-Res-Lgt-LPD Int-All-All-C","Commercial-Resturant-Misc","Commercial-Resturant-Motors","Commercial-Resturant-OffEquip","Commercial-Resturant-Process","Commercial-Resturant-Refrig","Commercial-Resturant-Vent","None"]
[null,"Retail","Commercial-Retail-AirComp","Commercial-Retail-Cook","Commercial-Retail-Cool","Commercial-Retail-ExtLight","Commercial-Retail-Heat","Commercial-Retail-HotWater","C-Ret-Lgt-LPD Int-All-All-C","Commercial-Retail-Misc","Commercial-Retail-Motors","Commercial-Retail-OffEquip","Commercial-Retail-Process","Commercial-Retail-Refrig","Commercial-Retail-Vent","None"]
{"$rows_left_out":8}